{"text_format":"1","workbook":"xlsx","n_sheets":4,"sheets":["操作方法","入力シート","契約書印刷","促進計画一覧表"],"not_rendered":{"charts":0,"images":0,"macros":0,"external_links":0,"defined_names":52,"comments":0,"pivot_tables":0},"unopened":[],"bounds":{"document_bytes":16777216,"sheet_cells":100000,"rows_first":2000,"rows_last":500,"rows_between":2000,"halvings":0,"cell_chars":16384,"cell_head_chars":4096},"cells_cut":0,"cells_raw":0,"read":"whole","date_system":"1900"}

{"sheet":"操作方法","index":0,"n_rows":27,"n_cols":3,"rows_kept":27,"cut":false,"hidden":false,"merged":[[15,2,15,16]]}
["経営受託権に関する農地利用集積等促進計画の入力方法"]
["基本事項"]
[1,"契約書(様式第13号)を作成するためのデータは全て「入力シート」から入力ください。"]
[2,"契約書(様式第13号)の印刷は「契約書印刷」で行います。"]
[3,"「促進計画一覧表」は「入力シート」にデータを入力することで自動的に作成されます。この促進計画一覧表は契約書(様式第13号)と併せてバンクへ提出が必要です。"]
[4,"このExcelファイルは契約開始期毎に別ファイルとし，押印後の契約書(様式第13号)と併せて農地バンクへ提出ください（市町村でもファイルの保管をお願いします）。"]
[]
["入力・操作方法"]
[null,"データは必ず「入力シート」から入力ください。"]
[null,"①","入力シートの「Ｆ３セル」に市町村名を入力します。"]
[null,"②","Ｄ列に契約開始期をＲ〇.▲(〇年▲月)と入力します。"]
[null,"③","Ｅ列の整理番号の付与は次のようなルールとします（例：委託開始期が１月の場合100～スタート，12月の場合1200～スタート　各月最大100契約以内）。"]
[null,"④","電話番号（Ｈ列とＫ列およびＡＥ列）は，契約書(様式第13号)および促進計画一覧表には表記されませんが事務連絡上必要となる場合がありますので入力ください。"]
[null,"⑤","Ｌ列の「地域計画」の欄は，経営委託する農地が地域計画内の農地であれば，リストから〇を選択してください。"]
[null,"⑥","Ｎ列の「字」がない場合は省略可"]
{"$rows_left_out":13}
{"sheet":"入力シート","index":1,"n_rows":100,"n_cols":39,"rows_kept":100,"cut":false,"hidden":false,"merged":[[5,30,6,30],[77,32,86,32],[77,21,86,21],[77,11,86,11],[77,22,86,22],[77,23,86,23],[77,24,86,24],[77,8,86,8],[77,9,86,9],[77,10,86,10],[77,19,86,19],[77,20,86,20],[67,32,76,32],[57,25,66,25],[57,26,66,26],[57,32,66,32],[57,21,66,21],[57,11,66,11],[57,22,66,22],[57,23,66,23],[57,24,66,24],[57,8,66,8],[57,9,66,9],[57,10,66,10],[77,3,86,3],[77,4,86,4],[77,5,86,5],[77,6,86,6],[77,7,86,7],[67,23,76,23],[67,24,76,24],[67,25,76,25],[67,26,76,26],[77,25,86,25],[77,26,86,26],[67,3,76,3],[67,4,76,4],[67,5,76,5],[67,6,76,6],[67,7,76,7],[67,8,76,8],[67,9,76,9],[67,10,76,10],[67,19,76,19],[67,20,76,20],[67,21,76,21],[67,11,76,11],[67,22,76,22],[57,19,66,19],[57,20,66,20],[57,3,66,3],[57,4,66,4],[57,5,66,5],[57,6,66,6],[57,7,66,7],[47,23,56,23],[47,24,56,24],[47,25,56,25],[47,26,56,26],[47,32,56,32],[37,25,46,25],[37,26,46,26],[37,32,46,32],[47,3,56,3],[47,4,56,4],[47,5,56,5],[47,6,56,6],[47,7,56,7],[47,8,56,8],[47,9,56,9],[47,10,56,10],[47,19,56,19],[47,20,56,20],[47,21,56,21],[47,11,56,11],[47,22,56,22],[4,34,4,38],[37,3,46,3],[37,4,46,4],[37,5,46,5],[37,6,46,6],[37,7,46,7],[37,8,46,8],[37,9,46,9],[37,10,46,10],[37,19,46,19],[37,20,46,20],[37,21,46,21],[37,11,46,11],[37,22,46,22],[37,23,46,23],[37,24,46,24],[7,26,16,26],[7,25,16,25],[7,8,16,8],[17,23,26,23],[17,8,26,8],[17,9,26,9],[7,10,16,10],[27,5,36,5],[5,1,6,2],[4,1,4,2],[5,28,6,28],[5,29,6,29],[5,27,6,27],[5,22,6,22],[5,25,5,26],[2,3,2,4],[4,3,6,3],[4,4,6,4],[4,5,4,7],[4,8,4,10],[5,5,6,5],[5,6,6,6],[5,7,6,7],[5,8,6,8],[5,9,6,9],[5,10,6,10],[4,22,4,26],[5,16,6,16],[5,17,6,17],[5,18,6,18],[5,23,5,24],[4,19,4,21],[27,6,36,6],[27,7,36,7],[4,32,6,32],[7,3,16,3],[7,4,16,4],[7,5,16,5],[7,6,16,6],[7,7,16,7],[4,27,4,29],[7,19,16,19],[7,20,16,20],[7,21,16,21],[7,11,16,11],[7,23,16,23],[7,9,16,9],[27,9,36,9],[27,10,36,10],[27,11,36,11],[17,3,26,3],[17,4,26,4],[17,5,26,5],[17,6,26,6],[17,7,26,7],[27,8,36,8],[17,10,26,10],[17,11,26,11],[27,21,36,21],[27,20,36,20],[27,19,36,19],[27,3,36,3],[27,4,36,4],[27,32,36,32],[5,12,6,12],[5,13,6,13],[5,14,6,14],[5,15,6,15],[17,32,26,32],[7,32,16,32],[5,11,6,11],[27,23,36,23],[27,24,36,24],[5,19,6,19],[4,31,6,31],[17,24,26,24],[5,20,6,20],[5,21,6,21],[7,24,16,24],[7,22,16,22],[17,19,26,19],[17,20,26,20],[17,21,26,21],[17,25,26,25],[27,25,36,25],[17,26,26,26],[27,26,36,26],[17,22,26,22],[27,22,36,22]]}
[null,null,null,null,null,null,"市町村毎の入力シート　兼　農地バンクの契約管理及び集計シート  (経営受託権)"]
[]
[null,null,null,"市町村名：",null,"鹿児島市"]
[]
[null,"システム利用欄",null,"契約\n開始期","整理番号","農業経営を委託する者(甲)",null,null,"農業経営を受託する者(丙)",null,null,null,null,null,null,null,null,null,null,"農業経営を委託する期間",null,null,"損益の決裁方法等",null,null,null,null,"農地に関する甲以外の権限者",null,null,null,"備　　考","契約変更履歴等のメモ",null,"プルダウンリスト(システム使用欄)"]
[null,null,null,null,null,"氏名・名称","住所","電話番号","氏名・名称","住所","電話番号","地域計画\n（区域内は〇）","大字","字","地番","現況地目","耕作面積\n（㎡）","登記面積\n（㎡）","利用目的","依託の始期","依託の終期","契約期間","受託報酬額\n（円）","販売金額等＞受託経費の場合",null,"販売金額等＜受託経費の場合",null,"住　　所","氏　名","権限の種類","電話番号"]
[null,null,null,null,null,null,null,null,null,null,null,null,null,null,null,null,null,null,null,null,null,null,null,"支払い方法\n丙→甲","支払期限\n(毎年●月末)","支払い方法\n甲→丙","支払期限\n(毎年●月末)"]
[null,"A",{"$f":"E8&B8","v":"100A"},"R5.10",100,"農地　太郎","鹿児島市名山町１番１号","099-000-0000","耕地　大作","鹿児島市鴨池新町10番１号","099-000-0000","〇","名山町1","名山堀1",1001,"田",1101,1000,"水田","2023-10-01","2038-09-30",{"$f":"TEXT(DATEDIF(T8,(U8)+1,\"y\"),\"0年;;\")&TEXT(DATEDIF(T8,(U8)+1,\"ym\"),\"0ヶ月;;\")","v":"15年"},150000,"現金払",11,"口座振込",10,"鹿児島市名山町4番1号","農地次郎","所有権","111-2222",null,null,null,1,"〇","田","現金払","所有権"]
[null,"B",{"$f":"E8&B9","v":"100B"},null,null,null,null,null,null,null,null,null,"名山町2","名山堀2",1002,"田",1102,1000,"水田",null,null,null,null,null,null,null,null,"鹿児島市鴨池旧町10番","農地三郎","所有権","244-8888",null,null,null,2,null,"畑","口座振込"]
[null,"C",{"$f":"E8&B10","v":"100C"},null,null,null,null,null,null,null,null,null,"名山町3","新田1",1003,"畑",1103,1000,"普通畑",null,null,null,null,null,null,null,null,null,null,null,null,null,null,null,3,null,"樹園地"]
[null,"D",{"$f":"E8&B11","v":"100D"},null,null,null,null,null,null,null,null,null,"名山町4","新田2",1004,"畑",1104,1000,"普通畑",null,null,null,null,null,null,null,null,null,null,null,null,null,null,null,4]
[null,"E",{"$f":"E8&B12","v":"100E"},null,null,null,null,null,null,null,null,null,"名山町5","新田3",1005,"畑",1105,1000,"普通畑",null,null,null,null,null,null,null,null,null,null,null,null,null,null,null,5]
[null,"F",{"$f":"E8&B13","v":"100F"},null,null,null,null,null,null,null,null,null,"名山町6","新田4",1006,"畑",600,506,"施設用地"]
[null,"G",{"$f":"E8&B14","v":"100G"},null,null,null,null,null,null,null,null,null,"名山町7","新田5",1007,"樹園地",600,507,"樹園地",null,null,null,null,null,null,null,null,null,null,null,null,null,null,null,"水田"]
[null,"H",{"$f":"E8&B15","v":"100H"},null,null,null,null,null,null,null,null,null,"名山町8","新田6",1008,"田",600,508,"水田",null,null,null,null,null,null,null,null,null,null,null,null,null,null,null,"普通畑"]
{"$rows_left_out":86}
{"sheet":"契約書印刷","index":2,"n_rows":82,"n_cols":33,"rows_kept":82,"cut":false,"hidden":false,"merged":[[10,24,12,28],[1,31,2,32],[36,1,36,7],[37,1,37,7],[36,8,36,10],[37,8,37,10],[38,1,38,7],[38,8,38,10],[36,15,36,21],[37,15,37,21],[38,15,38,21],[36,25,36,26],[36,27,36,28],[37,25,37,26],[37,27,37,28],[38,25,38,26],[38,27,38,28],[36,22,36,24],[37,22,37,24],[38,22,38,24],[1,14,1,15],[2,1,2,28],[31,1,32,1],[25,2,26,2],[27,2,28,2],[29,2,30,2],[19,1,20,1],[19,2,20,2],[19,3,20,3],[19,4,20,4],[21,1,22,1],[21,2,22,2],[21,3,22,3],[21,4,22,4],[25,1,26,1],[27,1,28,1],[29,1,30,1],[17,8,18,8],[31,8,32,8],[19,19,23,19],[24,19,32,19],[13,22,17,23],[19,22,23,23],[24,22,32,23],[23,5,23,7],[13,24,14,28],[15,24,16,28],[17,24,18,28],[19,24,20,28],[21,24,22,28],[23,24,24,28],[25,24,26,28],[27,24,28,28],[13,5,13,7],[13,12,22,15],[7,1,9,2],[8,3,9,8],[27,12,27,13],[29,5,29,7],[19,5,19,7],[15,1,16,1],[15,2,16,2],[15,3,16,3],[15,4,16,4],[17,1,18,1],[17,2,18,2],[17,3,18,3],[17,4,18,4],[13,1,14,1],[13,2,14,2],[13,3,14,3],[13,4,14,4],[28,12,32,15],[26,12,26,15],[21,5,21,7],[23,8,24,8],[19,8,20,8],[21,8,22,8],[15,8,16,8],[90,1,90,2],[90,3,91,3],[4,20,5,28],[6,3,7,8],[6,9,7,15],[6,20,7,28],[11,20,11,23],[8,20,9,28],[11,5,11,7],[11,8,12,8],[11,16,11,19],[10,1,10,7],[10,8,10,11],[10,12,10,23],[8,16,8,17],[8,18,9,19],[9,16,9,17],[12,17,12,18],[12,22,12,23],[11,1,11,3],[4,18,5,19],[4,16,4,17],[5,16,5,17],[11,4,12,4],[6,16,6,17],[6,18,7,19],[7,16,7,17],[11,11,12,11],[8,9,9,15],[11,12,12,15],[89,1,89,4],[85,1,88,1],[85,2,87,2],[85,3,86,8],[31,5,31,7],[15,5,15,7],[17,5,17,7],[13,8,14,8],[23,4,24,4],[23,1,24,1],[23,2,24,2],[23,3,24,3],[85,17,86,19],[4,1,6,2],[4,3,5,8],[4,9,5,15],[11,9,12,9],[11,10,12,10],[34,27,34,28],[13,17,32,18],[13,20,32,20],[13,21,32,21],[13,16,32,16],[13,9,32,9],[13,10,32,10],[13,11,32,11],[13,19,17,19],[29,24,30,28],[31,24,32,28],[87,3,88,8],[87,17,88,19],[87,20,88,28],[93,21,93,23],[89,16,91,16],[89,17,91,19],[89,20,91,20],[89,21,89,28],[90,11,91,11],[90,12,91,12],[90,13,91,14],[93,15,94,15],[90,21,91,23],[90,24,91,24],[93,27,93,28],[94,13,94,14],[90,25,91,25],[90,26,91,26],[90,27,91,28],[92,13,92,14],[92,17,92,19],[92,21,92,23],[92,27,92,28],[90,4,91,4],[85,20,86,28],[98,13,98,14],[95,13,95,14],[95,17,95,19],[95,21,95,23],[95,27,95,28],[96,13,96,14],[96,17,96,19],[96,21,96,23],[96,27,96,28],[94,17,94,19],[94,21,94,23],[94,27,94,28],[97,27,97,28],[98,17,98,19],[98,21,98,23],[98,27,98,28],[90,8,91,8],[90,9,91,9],[90,10,91,10],[93,13,93,14],[97,13,97,14],[97,17,97,19],[93,17,93,19],[97,21,97,23],[101,27,101,28],[102,1,102,4],[102,13,102,14],[102,17,102,19],[102,21,102,23],[102,27,102,28],[99,13,99,14],[99,17,99,19],[99,21,99,23],[99,27,99,28],[100,13,100,14],[100,17,100,19],[100,21,100,23],[100,27,100,28],[133,24,133,26],[134,24,134,26],[135,24,135,26],[101,13,101,14],[101,17,101,19],[101,21,101,23],[137,24,138,24],[137,25,138,26],[142,15,143,15],[139,16,140,20],[139,21,140,22],[139,23,140,26],[137,17,138,18],[137,19,138,19],[137,20,138,20],[137,21,138,21],[137,22,138,23],[159,3,160,8],[159,17,160,19],[159,20,160,28],[161,1,161,4],[162,1,162,2],[162,3,163,3],[162,4,163,4],[162,8,163,8],[162,9,163,9],[162,10,163,10],[162,11,163,11],[162,12,163,12],[162,13,163,14],[157,1,160,1],[157,2,159,2],[157,3,158,8],[157,17,158,19],[162,21,163,23],[162,24,163,24],[162,25,163,25],[162,26,163,26],[162,27,163,28],[171,13,171,14],[157,20,158,28],[164,13,164,14],[164,17,164,19],[164,21,164,23],[164,27,164,28],[165,13,165,14],[165,17,165,19],[165,21,165,23],[165,27,165,28],[161,16,163,16],[161,17,163,19],[161,20,163,20],[161,21,161,28],[168,27,168,28],[169,13,169,14],[169,17,169,19],[166,17,166,19],[166,21,166,23],[166,27,166,28],[167,13,167,14],[167,17,167,19],[167,21,167,23],[167,27,167,28],[166,13,166,14],[170,13,170,14],[165,15,166,15],[174,1,174,4],[174,13,174,14],[174,17,174,19],[174,21,174,23],[174,27,174,28],[205,24,205,26],[172,13,172,14],[172,17,172,19],[172,21,172,23],[172,27,172,28],[173,13,173,14],[173,17,173,19],[173,21,173,23],[173,27,173,28],[170,17,170,19],[170,21,170,23],[170,27,170,28],[171,17,171,19],[171,21,171,23],[171,27,171,28],[168,13,168,14],[168,17,168,19],[168,21,168,23],[169,21,169,23],[169,27,169,28],[209,24,210,24],[209,25,210,26],[214,15,215,15],[211,16,212,20],[211,21,212,22],[211,23,212,26],[206,24,206,26],[207,24,207,26],[209,17,210,18],[209,19,210,19],[209,20,210,20],[209,21,210,21],[209,22,210,23],[231,3,232,8],[231,17,232,19],[231,20,232,28],[233,1,233,4],[234,1,234,2],[234,3,235,3],[234,4,235,4],[234,8,235,8],[234,9,235,9],[234,10,235,10],[234,11,235,11],[234,12,235,12],[234,13,235,14],[229,1,232,1],[229,2,231,2],[229,3,230,8],[229,17,230,19],[234,21,235,23],[234,24,235,24],[234,25,235,25],[234,26,235,26],[234,27,235,28],[243,13,243,14],[229,20,230,28],[236,13,236,14],[236,17,236,19],[236,21,236,23],[236,27,236,28],[237,13,237,14],[237,17,237,19],[237,21,237,23],[237,27,237,28],[233,16,235,16],[233,17,235,19],[233,20,235,20],[233,21,233,28],[240,27,240,28],[241,13,241,14],[241,17,241,19],[238,17,238,19],[238,21,238,23],[238,27,238,28],[239,13,239,14],[239,17,239,19],[239,21,239,23],[239,27,239,28],[238,13,238,14],[242,13,242,14],[237,15,238,15],[246,1,246,4],[246,13,246,14],[246,17,246,19],[246,21,246,23],[246,27,246,28],[277,24,277,26],[244,13,244,14],[244,17,244,19],[244,21,244,23],[244,27,244,28],[245,13,245,14],[245,17,245,19],[245,21,245,23],[245,27,245,28],[242,17,242,19],[242,21,242,23],[242,27,242,28],[243,17,243,19],[243,21,243,23],[243,27,243,28],[240,13,240,14],[240,17,240,19],[240,21,240,23],[241,21,241,23],[241,27,241,28],[281,24,282,24],[281,25,282,26],[286,15,287,15],[283,16,284,20],[283,21,284,22],[283,23,284,26],[278,24,278,26],[279,24,279,26],[281,17,282,18],[281,19,282,19],[281,20,282,20],[281,21,282,21],[281,22,282,23],[301,17,302,19],[301,20,302,28],[303,3,304,8],[303,17,304,19],[303,20,304,28],[305,1,305,4],[306,1,306,2],[306,3,307,3],[306,4,307,4],[306,8,307,8],[306,9,307,9],[306,10,307,10],[306,11,307,11],[306,12,307,12],[306,13,307,14],[301,1,304,1],[301,2,303,2],[301,3,302,8],[305,16,307,16],[305,17,307,19],[305,20,307,20],[305,21,305,28],[309,15,310,15],[306,21,307,23],[306,24,307,24],[306,25,307,25],[306,26,307,26],[306,27,307,28],[310,21,310,23],[310,27,310,28],[311,13,311,14],[311,17,311,19],[311,21,311,23],[311,27,311,28],[308,13,308,14],[308,17,308,19],[308,21,308,23],[308,27,308,28],[309,13,309,14],[309,17,309,19],[309,21,309,23],[309,27,309,28],[310,13,310,14],[310,17,310,19],[314,27,314,28],[315,13,315,14],[315,17,315,19],[315,21,315,23],[315,27,315,28],[312,13,312,14],[312,17,312,19],[312,21,312,23],[312,27,312,28],[313,13,313,14],[313,17,313,19],[313,21,313,23],[313,27,313,28],[314,13,314,14],[314,17,314,19],[314,21,314,23],[318,1,318,4],[318,13,318,14],[318,17,318,19],[318,21,318,23],[318,27,318,28],[349,24,349,26],[316,13,316,14],[316,17,316,19],[316,21,316,23],[316,27,316,28],[317,13,317,14],[317,17,317,19],[317,21,317,23],[317,27,317,28],[353,24,354,24],[353,25,354,26],[358,15,359,15],[355,16,356,20],[355,21,356,22],[355,23,356,26],[350,24,350,26],[351,24,351,26],[353,17,354,18],[353,19,354,19],[353,20,354,20],[353,21,354,21],[353,22,354,23],[0,1,0,28],[36,11,36,12],[37,11,37,12],[36,13,36,14],[37,13,37,14],[38,11,38,12],[38,13,38,14],[33,5,33,7],[31,2,32,2],[25,3,26,3],[27,3,28,3],[29,3,30,3],[31,3,32,3],[25,4,26,4],[27,4,28,4],[29,4,30,4],[31,4,32,4],[25,5,25,7],[27,5,27,7],[27,8,28,8],[33,1,34,4],[25,8,26,8],[29,8,30,8],[3,3,3,4]]}
[]
[null,"（様式第13号）",null,"農用地利用集積等促進計画（経営受託権）",null,null,null,null,null,null,null,null,null,null,null,null,null,null,null,null,null,null,null,null,null,null,null,null,null,null,null,"システム使用欄"]
[]
[null,"１　各筆明細",null,"農地の所在地",null,null,{"$f":"入力シート!F3","v":"鹿児島市"},null,null,null,null,null,null,null,null,null,null,null,null,null,null,null,null,null,"契約開始期",{"$f":"VLOOKUP(AF4,入力シート!C:D,2,FALSE)","v":"R5.10"},"整理番号",null,101,null,null,{"$f":"$AC$4&\"A\"","v":"101A"},{"$f":"VLOOKUP($AF$4,入力シート!$C:$AG,10,FALSE)","v":0}]
[null,{"$f":"IF(AG4=\"〇\",\"☑　地域計画\",\"☐　地域計画\")","v":"☐　地域計画"},{"$f":"IF(#REF!=\"○\",\"☑　現金払\",\"☐　現金払\")","v":{"$error":"#REF!"}},"農地中間管理機構に権利の設定をする者（農業経営の委託をする者）の氏名または名称（甲）",null,null,null,null,null,{"$f":"VLOOKUP(AF4,入力シート!C:AF,4,FALSE)","v":"名山　太郎"},null,null,null,null,null,null,"この計画に同意する。",null,"住所",null,{"$f":"VLOOKUP(AF4,入力シート!C:AF,5,FALSE)","v":"鹿児島市山下町2番2号"},null,null,null,null,null,null,null,null,null,null,{"$f":"$AC$4&\"B\"","v":"101B"}]
[null,null,null,null,null,null,null,null,null,null,null,null,null,null,null,null,"〔同意印〕",null,null,null,null,null,null,null,null,null,null,null,null,null,null,{"$f":"$AC$4&\"C\"","v":"101C"},{"$f":"VLOOKUP($AF$4,入力シート!$C:$AF,13,FALSE)","v":2001}]
[null,null,null,"鹿児島県農地中間管理機構（乙）",null,null,null,null,null,"公益財団法人　鹿児島県地域振興公社\n理事長　満薗　秀彦",null,null,null,null,null,null,"この計画に同意する。",null,"住所",null,"鹿児島市名山町４番３号",null,null,null,null,null,null,null,null,null,null,{"$f":"$AC$4&\"D\"","v":"101D"}]
[null,null,null,null,null,null,null,null,null,null,null,null,null,null,null,null,"〔同意印〕",null,null,null,null,null,null,null,null,null,null,null,null,null,null,{"$f":"$AC$4&\"E\"","v":"101E"}]
[null,null,null,"農地中間管理機構から権利の設定を受ける者（農業経営の委託を受ける者）の氏名または名称（丙）",null,null,null,null,null,{"$f":"VLOOKUP(AF4,入力シート!C:AF,7,FALSE)","v":"名山　大作"},null,null,null,null,null,null,"この計画に同意する。",null,"住所",null,{"$f":"VLOOKUP(AF4,入力シート!C:AF,8,FALSE)","v":"鹿児島市西田10番１号"},null,null,null,null,null,null,null,null,null,null,{"$f":"$AC$4&\"F\"","v":"101F"}]
[null,null,null,null,null,null,null,null,null,null,null,null,null,null,null,null,"〔同意印〕",null,null,null,null,null,null,null,null,null,null,null,null,null,null,{"$f":"$AC$4&\"G\"","v":"101G"}]
[null,"権利の設定をする土地（Ａ）",null,null,null,null,null,null,"（甲）→（乙），（乙）→（丙）に\n設定される権利（Ｂ）",null,null,null,"損益の算定基準，決済方法等（Ｃ）",null,null,null,null,null,null,null,null,null,null,null,"備　　考",null,null,null,null,null,null,{"$f":"$AC$4&\"H\"","v":"101H"}]
[null,"所　　在",null,null,"現 況\n地 目","耕作面積(㎡)",null,null,"利用目的","始　期","終　期","存続期間","損益の算定基準の計算方法および\n受託報酬額（円）",null,null,null,"販売金額が受託経費\nを上回った場合",null,null,null,"販売金額が受託経費\nを下回った場合",null,null,null,null,null,null,null,null,null,null,{"$f":"$AC$4&\"I\"","v":"101I"}]
[null,"大  字","字","地　番",null,"(","登記面積",")",null,null,null,null,null,null,null,null,"支払人","相手方",null,"決済方法\n支払期限","支払人","相手方","決済方法\n支払期限",null,null,null,null,null,null,null,null,{"$f":"$AC$4&\"J\"","v":"101J"}]
[null,{"$f":"VLOOKUP($AF$4,入力シート!$C:$AF,11,FALSE)","v":"東開町1"},{"$f":"VLOOKUP($AF$4,入力シート!$C:$AF,12,FALSE)","v":"山田1"},{"$f":"VLOOKUP($AF$4,入力シート!$C:$AF,13,FALSE)","v":2001},{"$f":"VLOOKUP($AF$4,入力シート!$C:$AF,14,FALSE)","v":"田"},{"$f":"VLOOKUP($AF$4,入力シート!$C:$AF,15,FALSE)","v":1000},null,null,{"$f":"VLOOKUP($AF$4,入力シート!$C:$AF,17,FALSE)","v":"施設用地"},{"$f":"VLOOKUP($AF$4,入力シート!$C:$AF,18,FALSE)","v":"2023-10-01"},{"$f":"VLOOKUP($AF$4,入力シート!$C:$AF,19,FALSE)","v":"2038-09-30"},{"$f":"VLOOKUP($AF$4,入力シート!$C:$AF,20,FALSE)","v":"15年"},"３　共通事項（７）に記載のとおり\n\n「受託農業経営に係る販売金額（共済金等を含む。）」\n－「受託農業経営に係る受託経費（受託報酬を含む）」",null,null,null,"丙","甲",null,{"$f":"VLOOKUP($AF$4,入力シート!$C:$AF,22,FALSE)","v":"口座振込"},"甲","丙",{"$f":"VLOOKUP($AF$4,入力シート!$C:$AF,24,FALSE)","v":"現金払"},{"$f":"VLOOKUP($AF$4,入力シート!$C:$AF,22,FALSE)","v":"口座振込"},{"$f":"VLOOKUP($AF$4,入力シート!$C:$AF,30,FALSE)","v":0}]
[null,null,null,null,null,"(",{"$f":"VLOOKUP($AF$4,入力シート!$C:$AF,16,FALSE)","v":0},")"]
{"$rows_left_out":68}
{"sheet":"促進計画一覧表","index":3,"n_rows":93,"n_cols":25,"rows_kept":93,"cut":false,"hidden":false,"merged":[[62,12,69,12],[73,12,80,12],[84,12,91,12],[82,23,91,23],[82,24,91,24],[82,15,91,15],[82,17,91,17],[82,18,91,18],[82,19,91,19],[82,21,91,21],[82,22,91,22],[71,17,80,17],[60,15,69,15],[60,17,69,17],[82,9,91,9],[82,10,91,10],[82,11,91,11],[82,13,91,13],[82,14,91,14],[82,16,91,16],[71,9,80,9],[71,10,80,10],[71,11,80,11],[71,13,80,13],[71,14,80,14],[71,15,80,15],[60,9,69,9],[60,10,69,10],[60,11,69,11],[49,23,58,23],[60,16,69,16],[49,24,58,24],[71,21,80,21],[71,22,80,22],[71,23,80,23],[71,24,80,24],[60,23,69,23],[60,24,69,24],[60,18,69,18],[60,19,69,19],[60,21,69,21],[60,22,69,22],[71,16,80,16],[49,16,58,16],[60,13,69,13],[60,14,69,14],[49,18,58,18],[49,19,58,19],[49,21,58,21],[49,22,58,22],[49,9,58,9],[49,10,58,10],[49,11,58,11],[49,13,58,13],[49,14,58,14],[49,15,58,15],[49,17,58,17],[38,15,47,15],[38,17,47,17],[38,9,47,9],[38,10,47,10],[38,11,47,11],[38,13,47,13],[38,14,47,14],[38,16,47,16],[40,12,47,12],[51,12,58,12],[16,23,25,23],[16,24,25,24],[27,20,36,20],[38,20,47,20],[27,9,36,9],[27,10,36,10],[27,11,36,11],[27,13,36,13],[27,14,36,14],[27,15,36,15],[27,17,36,17],[27,18,36,18],[27,19,36,19],[27,16,36,16],[29,12,36,12],[38,21,47,21],[38,22,47,22],[27,23,36,23],[27,24,36,24],[27,21,36,21],[27,22,36,22],[38,23,47,23],[2,1,4,1],[2,2,2,7],[2,8,2,11],[2,21,2,22],[5,9,14,9],[5,10,14,10],[5,11,14,11],[16,9,25,9],[16,10,25,10],[16,11,25,11],[3,12,4,12],[5,16,14,16],[16,16,25,16],[5,20,14,20],[16,20,25,20],[16,13,25,13],[16,14,25,14],[16,15,25,15],[16,17,25,17],[16,18,25,18],[16,19,25,19],[16,21,25,21],[5,15,14,15],[5,17,14,17],[3,2,4,2],[3,3,4,3],[3,4,4,4],[3,5,4,5],[3,21,4,21],[3,22,4,22],[3,6,3,7],[3,8,4,8],[3,9,4,9],[3,10,4,10],[3,11,4,11],[3,13,3,16],[3,17,3,20],[49,20,58,20],[60,20,69,20],[71,20,80,20],[82,20,91,20],[71,18,80,18],[71,19,80,19],[38,18,47,18],[38,19,47,19],[2,23,2,24],[3,23,4,23],[3,24,4,24],[2,12,2,20],[7,12,14,12],[18,12,25,12],[38,24,47,24],[5,23,14,23],[5,24,14,24],[5,18,14,18],[5,19,14,19],[5,21,14,21],[5,22,14,22],[5,13,14,13],[5,14,14,14],[16,22,25,22]]}
[null,null,null,"農用地利用集積等促進計画一覧表（経営受託権）"]
[null,null,"市町村名：",{"$f":"入力シート!F3","v":"鹿児島市"}]
[null,"No","対象農地",null,null,null,null,null,"設定される権利の内容",null,null,null,"損益について",null,null,null,null,null,null,null,null,"農業経営を委託する者(甲)",null,"農業経営を受託する者(丙)"]
[null,null,"大字","字","地番","地目","面積(㎡)",null,"利用目的","始期","終期","存続期間","損益の算定基準","販売金額＞受託経費の場合",null,null,null,"販売金額＜受託経費の場合",null,null,null,"氏名・名称","住所","氏名・名称","住所"]
[null,null,null,null,null,null,"耕作面積","登記面積",null,null,null,null,null,"支払人","相手方","決裁方法","支払期限","支払人","相手方","決裁方法","支払期限"]
[null,1,{"$f":"IF(入力シート!M8=\"\",\"\",入力シート!M8)","v":"名山町1"},{"$f":"IF(入力シート!N8=\"\",\"\",入力シート!N8)","v":"名山堀1"},{"$f":"IF(入力シート!O8=\"\",\"\",入力シート!O8)","v":1001},{"$f":"IF(入力シート!P8=\"\",\"\",入力シート!P8)","v":"田"},{"$f":"IF(入力シート!Q8=\"\",\"\",入力シート!Q8)","v":1101},{"$f":"IF(入力シート!R8=\"\",\"\",入力シート!R8)","v":1000},{"$f":"IF(入力シート!S8=\"\",\"\",入力シート!S8)","v":"水田"},{"$f":"IF(入力シート!T8=\"\",\"\",入力シート!T8)","v":"2023-10-01"},{"$f":"IF(入力シート!U8=\"\",\"\",入力シート!U8)","v":"2038-09-30"},{"$f":"IF(入力シート!V8=\"\",\"\",入力シート!V8)","v":"15年"},{"$f":"IF(C6=\"\",\"\",\"受託報酬額(円)\")","v":"受託報酬額(円)"},{"$f":"IF(C6=\"\",\"\",\"丙\")","v":"丙"},{"$f":"IF(C6=\"\",\"\",\"甲\")","v":"甲"},{"$f":"IF(入力シート!X8=\"\",\"\",入力シート!X8)","v":"現金払"},{"$f":"IF(入力シート!Y8=\"\",\"\",入力シート!Y8)","v":11},{"$f":"IF(C6=\"\",\"\",\"甲\")","v":"甲"},{"$f":"IF(C6=\"\",\"\",\"丙\")","v":"丙"},{"$f":"IF(入力シート!Z8=\"\",\"\",入力シート!Z8)","v":"口座振込"},{"$f":"IF(入力シート!AA8=\"\",\"\",入力シート!AA8)","v":10},{"$f":"IF(入力シート!F8=\"\",\"\",入力シート!F8)","v":"農地　太郎"},{"$f":"IF(入力シート!G8=\"\",\"\",入力シート!G8)","v":"鹿児島市名山町１番１号"},{"$f":"IF(入力シート!I8=\"\",\"\",入力シート!I8)","v":"耕地　大作"},{"$f":"IF(入力シート!J8=\"\",\"\",入力シート!J8)","v":"鹿児島市鴨池新町10番１号"}]
[null,2,{"$f":"IF(入力シート!M9=\"\",\"\",入力シート!M9)","v":"名山町2"},{"$f":"IF(入力シート!N9=\"\",\"\",入力シート!N9)","v":"名山堀2"},{"$f":"IF(入力シート!O9=\"\",\"\",入力シート!O9)","v":1002},{"$f":"IF(入力シート!P9=\"\",\"\",入力シート!P9)","v":"田"},{"$f":"IF(入力シート!Q9=\"\",\"\",入力シート!Q9)","v":1102},{"$f":"IF(入力シート!R9=\"\",\"\",入力シート!R9)","v":1000},{"$f":"IF(入力シート!S9=\"\",\"\",入力シート!S9)","v":"水田"},null,null,null,{"$f":"IF(C6=\"\",\"\",入力シート!W8)","v":150000}]
[null,3,{"$f":"IF(入力シート!M10=\"\",\"\",入力シート!M10)","v":"名山町3"},{"$f":"IF(入力シート!N10=\"\",\"\",入力シート!N10)","v":"新田1"},{"$f":"IF(入力シート!O10=\"\",\"\",入力シート!O10)","v":1003},{"$f":"IF(入力シート!P10=\"\",\"\",入力シート!P10)","v":"畑"},{"$f":"IF(入力シート!Q10=\"\",\"\",入力シート!Q10)","v":1103},{"$f":"IF(入力シート!R10=\"\",\"\",入力シート!R10)","v":1000},{"$f":"IF(入力シート!S10=\"\",\"\",入力シート!S10)","v":"普通畑"},null,null,null,{"$f":"IF(C6=\"\",\"\",\"「受託農業経営に係る販売金額」－「受託農業経営に係る受託経費」\n共通事項(7)に記載のとおり\")","v":"「受託農業経営に係る販売金額」－「受託農業経営に係る受託経費」\n共通事項(7)に記載のとおり"}]
[null,4,{"$f":"IF(入力シート!M11=\"\",\"\",入力シート!M11)","v":"名山町4"},{"$f":"IF(入力シート!N11=\"\",\"\",入力シート!N11)","v":"新田2"},{"$f":"IF(入力シート!O11=\"\",\"\",入力シート!O11)","v":1004},{"$f":"IF(入力シート!P11=\"\",\"\",入力シート!P11)","v":"畑"},{"$f":"IF(入力シート!Q11=\"\",\"\",入力シート!Q11)","v":1104},{"$f":"IF(入力シート!R11=\"\",\"\",入力シート!R11)","v":1000},{"$f":"IF(入力シート!S11=\"\",\"\",入力シート!S11)","v":"普通畑"}]
[null,5,{"$f":"IF(入力シート!M12=\"\",\"\",入力シート!M12)","v":"名山町5"},{"$f":"IF(入力シート!N12=\"\",\"\",入力シート!N12)","v":"新田3"},{"$f":"IF(入力シート!O12=\"\",\"\",入力シート!O12)","v":1005},{"$f":"IF(入力シート!P12=\"\",\"\",入力シート!P12)","v":"畑"},{"$f":"IF(入力シート!Q12=\"\",\"\",入力シート!Q12)","v":1105},{"$f":"IF(入力シート!R12=\"\",\"\",入力シート!R12)","v":1000},{"$f":"IF(入力シート!S12=\"\",\"\",入力シート!S12)","v":"普通畑"}]
[null,6,{"$f":"IF(入力シート!M13=\"\",\"\",入力シート!M13)","v":"名山町6"},{"$f":"IF(入力シート!N13=\"\",\"\",入力シート!N13)","v":"新田4"},{"$f":"IF(入力シート!O13=\"\",\"\",入力シート!O13)","v":1006},{"$f":"IF(入力シート!P13=\"\",\"\",入力シート!P13)","v":"畑"},{"$f":"IF(入力シート!Q13=\"\",\"\",入力シート!Q13)","v":600},{"$f":"IF(入力シート!R13=\"\",\"\",入力シート!R13)","v":506},{"$f":"IF(入力シート!S13=\"\",\"\",入力シート!S13)","v":"施設用地"}]
[null,7,{"$f":"IF(入力シート!M14=\"\",\"\",入力シート!M14)","v":"名山町7"},{"$f":"IF(入力シート!N14=\"\",\"\",入力シート!N14)","v":"新田5"},{"$f":"IF(入力シート!O14=\"\",\"\",入力シート!O14)","v":1007},{"$f":"IF(入力シート!P14=\"\",\"\",入力シート!P14)","v":"樹園地"},{"$f":"IF(入力シート!Q14=\"\",\"\",入力シート!Q14)","v":600},{"$f":"IF(入力シート!R14=\"\",\"\",入力シート!R14)","v":507},{"$f":"IF(入力シート!S14=\"\",\"\",入力シート!S14)","v":"樹園地"}]
[null,8,{"$f":"IF(入力シート!M15=\"\",\"\",入力シート!M15)","v":"名山町8"},{"$f":"IF(入力シート!N15=\"\",\"\",入力シート!N15)","v":"新田6"},{"$f":"IF(入力シート!O15=\"\",\"\",入力シート!O15)","v":1008},{"$f":"IF(入力シート!P15=\"\",\"\",入力シート!P15)","v":"田"},{"$f":"IF(入力シート!Q15=\"\",\"\",入力シート!Q15)","v":600},{"$f":"IF(入力シート!R15=\"\",\"\",入力シート!R15)","v":508},{"$f":"IF(入力シート!S15=\"\",\"\",入力シート!S15)","v":"水田"}]
[null,9,{"$f":"IF(入力シート!M16=\"\",\"\",入力シート!M16)","v":"名山町9"},{"$f":"IF(入力シート!N16=\"\",\"\",入力シート!N16)","v":"新田7"},{"$f":"IF(入力シート!O16=\"\",\"\",入力シート!O16)","v":1009},{"$f":"IF(入力シート!P16=\"\",\"\",入力シート!P16)","v":"畑"},{"$f":"IF(入力シート!Q16=\"\",\"\",入力シート!Q16)","v":600},{"$f":"IF(入力シート!R16=\"\",\"\",入力シート!R16)","v":509},{"$f":"IF(入力シート!S16=\"\",\"\",入力シート!S16)","v":"普通畑"}]
[null,10,{"$f":"IF(入力シート!M17=\"\",\"\",入力シート!M17)","v":"名山町10"},{"$f":"IF(入力シート!N17=\"\",\"\",入力シート!N17)","v":"新田8"},{"$f":"IF(入力シート!O17=\"\",\"\",入力シート!O17)","v":1010},{"$f":"IF(入力シート!P17=\"\",\"\",入力シート!P17)","v":"樹園地"},{"$f":"IF(入力シート!Q17=\"\",\"\",入力シート!Q17)","v":600},{"$f":"IF(入力シート!R17=\"\",\"\",入力シート!R17)","v":510},{"$f":"IF(入力シート!S17=\"\",\"\",入力シート!S17)","v":"施設用地"}]
{"$rows_left_out":78}